{"text_format":"1","workbook":"xlsx","n_sheets":24,"sheets":["Report-generated automatically","Introduction","1. Coversheet-complete first","2. RTI page","3. Publication Scheme","4. Details Publication Scheme","5. Open data","6. Open data sets","6a. Open data sets working","7. Disclosure Log","8. Disclosure Log Documents","8a. Disclosure Log working","9. General privacy","IPP5. Personal Info Holdings","NPP5. Personal Info Holdings","IPP2. Forms Assessment","NPP1. Forms Assessment","IPP2-NPP1. Email Assessment","10. Other agency websites","11. Website issues","Electronic Audit","References","Menu","Document Control"],"not_rendered":{"charts":0,"images":2,"macros":1,"external_links":0,"defined_names":22,"comments":1,"pivot_tables":0},"unopened":[],"bounds":{"document_bytes":16777216,"sheet_cells":100000,"rows_first":2000,"rows_last":500,"rows_between":2000,"halvings":0,"cell_chars":16384,"cell_head_chars":4096},"cells_cut":0,"cells_raw":0,"read":"whole","date_system":"1900"}

{"sheet":"Report-generated automatically","index":0,"n_rows":115,"n_cols":9,"rows_kept":115,"cut":false,"hidden":false,"merged":[[89,7,89,8],[91,3,91,4],[91,5,91,6],[92,3,92,4],[92,5,92,6],[92,7,92,8],[91,7,91,8],[11,5,11,6],[10,1,10,8],[0,0,0,4],[0,6,0,8],[2,1,2,11],[8,5,8,6],[9,5,9,6],[8,1,8,4],[9,1,9,4],[11,1,11,4],[108,4,108,8],[110,4,110,8],[113,4,113,8],[111,4,111,8],[96,1,97,1],[98,3,98,8],[102,4,102,8],[103,4,103,8],[104,4,104,8],[114,4,114,8],[107,4,107,8],[109,4,109,8],[112,4,112,8],[71,3,71,8],[72,3,72,8],[73,3,73,8],[74,3,74,8],[88,7,88,8],[80,1,80,8],[82,1,82,8],[84,1,84,8],[75,3,75,8],[76,3,76,8],[106,4,106,8],[105,4,105,8],[24,1,24,8],[19,5,19,6],[21,5,21,6],[20,1,20,8],[50,4,50,8],[49,4,49,8],[44,4,44,8],[45,4,45,8],[46,4,46,8],[47,4,47,8],[48,4,48,8],[23,5,23,7],[22,1,22,8],[19,1,19,4],[21,1,21,4],[23,1,23,4],[69,1,70,1],[42,4,42,8],[43,4,43,8],[28,5,28,6],[28,7,28,8],[69,3,69,8],[70,3,70,8],[12,1,12,8],[14,1,14,8],[16,1,16,8],[18,1,18,8],[13,1,13,4],[15,1,15,4],[17,5,17,7],[13,5,13,6],[15,5,15,6],[17,1,17,4]]}
["Click here to get a list of worksheets and go quickly to another worksheet"]
[]
[null,"Desktop audit of compliance with Right to Information Act 2009 and Information Privacy Act 2009"]
[]
[null,{"$f":"IF('1. Coversheet-complete first'!$C$15=\"\",\"Agency Name\", '1. Coversheet-complete first'!$C$15)","v":"Agency Name"}]
[]
{"$rows_left_out":110}
{"sheet":"Introduction","index":1,"n_rows":38,"n_cols":4,"rows_kept":38,"cut":false,"hidden":false,"merged":[[16,1,16,3],[17,1,17,3],[34,2,34,3],[35,1,35,3],[25,2,25,3],[31,1,31,3],[30,1,30,3],[26,2,26,3],[28,1,28,3],[18,1,18,3],[6,1,6,3],[13,1,13,3],[37,1,37,2],[32,1,32,2],[24,2,24,3],[9,1,9,3],[10,1,10,3],[14,1,14,3],[15,1,15,3],[20,1,20,3],[23,2,23,3],[29,1,29,3],[11,1,11,3],[12,1,12,3],[21,2,21,3],[22,2,22,3]]}
[]
[]
[]
[]
[]
[]
{"$rows_left_out":33}
{"sheet":"1. Coversheet-complete first","index":2,"n_rows":73,"n_cols":12,"rows_kept":73,"cut":false,"hidden":false,"merged":[[50,2,50,3],[51,2,51,3],[5,1,5,3],[6,1,6,3],[7,1,7,3],[31,1,31,3],[29,1,29,3],[0,0,0,2],[9,1,9,2],[10,1,10,2],[11,1,11,2],[12,1,13,2]]}
["Click here to get a list of worksheets and go quickly to another worksheet"]
[]
[null,"Access to Right to Information 2009 and Information Privacy Act 2009 Desktop Audit"]
[]
[null,"Notes on completing the desktop audit"]
[null,"This worksheet is to enable tracking of the specific audit and to provide a couple of required configuration items, the privacy principles and whether your agency has completed an electronic audit."]
{"$rows_left_out":68}
{"sheet":"2. RTI page","index":3,"n_rows":54,"n_cols":19,"rows_kept":54,"cut":false,"hidden":false,"merged":[[37,1,37,4],[21,1,21,4],[15,1,15,4],[0,0,0,2],[53,1,53,4],[6,1,6,4],[8,1,8,4],[9,1,9,4],[14,1,14,4],[52,2,52,3],[10,1,10,4],[26,4,31,4],[26,1,26,3],[33,1,33,4],[46,1,46,4],[44,1,44,4],[51,2,51,3],[51,4,52,4],[5,1,5,4]]}
["Click here to get a list of worksheets and go quickly to another worksheet"]
[]
[null,"Access to Right to Information Audit"]
[]
[null,"Notes on completing this worksheet"]
[null,"Agencies are expected to provide information to the public on how they can access agency information and their right to information.  An agency may have one or more web pages on the agencies' website that provides this information, these pages are considered their 'Right to Information page/s'."]
{"$rows_left_out":49}
{"sheet":"3. Publication Scheme","index":4,"n_rows":60,"n_cols":13,"rows_kept":60,"cut":false,"hidden":false,"merged":[[0,0,0,2],[10,1,10,4],[5,1,5,4],[6,1,6,4],[8,1,8,4],[7,2,7,4],[9,1,9,4],[14,1,14,4],[58,2,58,3],[51,1,51,4],[56,1,56,4],[40,1,40,4],[19,1,19,4],[22,1,22,4],[54,1,54,4],[57,2,57,3],[57,4,58,4],[26,1,26,4],[59,1,59,4],[15,1,15,4],[23,1,23,4],[41,1,41,4],[42,3,42,4],[43,3,43,4],[44,3,44,4],[45,3,45,4],[46,3,46,4],[47,3,47,4],[48,3,48,4],[49,3,49,4]]}
["Click here to get a list of worksheets and go quickly to another worksheet"]
[]
[null,"Publication Scheme Desktop Audit"]
[]
[null,"Notes on completing this worksheet"]
[null,"Under the Right to Information Act 2009 (RTI Act), agencies are required to publish a publication scheme as part of their websites. A publication scheme shows what information the agency routinely makes available and how the information can be accessed."]
{"$rows_left_out":55}
{"sheet":"4. Details Publication Scheme","index":5,"n_rows":172,"n_cols":15,"rows_kept":172,"cut":false,"hidden":false,"merged":[[0,0,0,2],[4,1,4,5],[5,1,5,5],[6,1,6,5],[171,1,171,5],[8,1,8,5],[9,1,9,5],[14,1,14,2],[11,1,11,5],[10,1,10,5],[12,1,12,5],[14,3,14,5],[7,1,7,5]]}
["Click here to get a list of worksheets and go quickly to another worksheet"]
[]
[null,"Publication Scheme Content Desktop Audit"]
[]
[null,"Notes on completing this worksheet"]
[null,"This worksheet provides an evaluation of the agency's Publication Scheme web pages against the seven classes of information specified in the Ministerial Guidelines."]
{"$rows_left_out":167}
{"sheet":"5. Open data","index":6,"n_rows":41,"n_cols":11,"rows_kept":41,"cut":false,"hidden":false,"merged":[[8,1,8,4],[35,1,35,4],[0,0,0,2],[37,1,37,4],[39,2,39,3],[9,1,9,4],[5,1,5,4],[6,1,6,4],[7,1,7,4],[40,1,40,4],[10,1,10,4],[16,1,16,4],[24,1,24,4],[19,1,19,4],[25,2,25,3],[38,2,38,3],[38,4,39,4]]}
["Click here to get a list of worksheets and go quickly to another worksheet"]
[]
[null,"Open Data Audit"]
[]
[null,"Notes on completing this worksheet"]
[null,"Use this worksheet to evaluate your agency's inclusion of open data as part of the RTI web presence against the Government requirement to have an open data strategy."]
{"$rows_left_out":36}
{"sheet":"6. Open data sets","index":7,"n_rows":532,"n_cols":18,"rows_kept":532,"cut":false,"hidden":false,"merged":[[0,0,0,4],[2,1,2,12],[4,1,4,12],[5,1,5,12],[6,1,6,12],[7,1,7,12],[8,1,8,12],[10,1,10,2],[10,3,10,9],[12,1,12,9]]}
["Click here to get a list of worksheets and go quickly to another worksheet"]
[]
[null,"Open data sets - Assessment of publication against agency open data strategy"]
[]
[null,"Notes on completing this worksheet"]
[null,"Agencies which publish an open data strategy outline the data sets they will make available and the date by which they will be published."]
{"$rows_left_out":527}
{"sheet":"6a. Open data sets working","index":8,"n_rows":2,"n_cols":2,"rows_kept":2,"cut":false,"hidden":false,"merged":[]}
[]
[null,"Feel free to enter any data you wish into this spreadsheet to record the contents of the open data strategy or data sets published on the open data portal."]

{"sheet":"7. Disclosure Log","index":9,"n_rows":66,"n_cols":14,"rows_kept":66,"cut":false,"hidden":false,"merged":[[57,2,57,3],[27,1,27,4],[34,1,34,4],[28,1,28,4],[65,1,65,4],[64,2,64,3],[45,1,45,4],[63,2,63,3],[63,4,64,4],[60,1,60,4],[58,1,58,4],[41,1,41,4],[48,1,48,4],[42,4,44,4],[54,1,54,4],[55,2,55,3],[56,2,56,3],[0,0,0,2],[17,1,17,4],[22,1,22,4],[5,1,5,4],[6,1,6,4],[7,1,7,4],[12,1,12,4],[16,1,16,4],[8,2,8,4],[9,1,9,4],[10,1,10,4],[11,1,11,4],[21,1,21,4]]}
["Click here to get a list of worksheets and go quickly to another worksheet"]
[]
[null,"Disclosure Log Desktop Audit"]
[]
[null,"Notes on completing this worksheet"]
[null,"Under the Right to Information Act 2009 (RTI Act), agencies may also publish online a disclosure log."]
{"$rows_left_out":61}
{"sheet":"8. Disclosure Log Documents","index":10,"n_rows":33,"n_cols":17,"rows_kept":33,"cut":false,"hidden":false,"merged":[[8,1,8,9],[9,1,9,9],[22,1,22,9],[0,0,0,2],[0,6,0,9],[4,1,4,9],[5,1,5,9],[6,1,6,9],[7,1,7,9],[20,2,20,9]]}
["Click here to get a list of worksheets and go quickly to another worksheet"]
[]
[null,{"$f":"CONCATENATE(\"Details of documents included on Agency Disclosure Log \", IF('7. Disclosure Log'!C63<>\"\", \"as at \"& TEXT('7. Disclosure Log'!C63,\"d/mm/yyyy\"),\"\"))","v":"Details of documents included on Agency Disclosure Log "}]
[]
[null,"Notes on completing this worksheet"]
[null,"This worksheet provides an opportunity to assess the volume and type of information released on the disclosure log to enable comparison with the volume released under RTI. "]
{"$rows_left_out":28}
{"sheet":"8a. Disclosure Log working","index":11,"n_rows":2,"n_cols":2,"rows_kept":2,"cut":false,"hidden":false,"merged":[]}
[]
[null,"Feel free to enter any data you wish into this spreadsheet to record the contents of the disclosure log."]

{"sheet":"9. General privacy","index":12,"n_rows":43,"n_cols":15,"rows_kept":43,"cut":false,"hidden":false,"merged":[[40,4,41,4],[41,2,41,3],[30,4,31,4],[42,1,42,4],[36,2,36,3],[38,2,38,3],[35,2,35,4],[37,2,37,4],[39,2,39,4],[34,2,34,3],[40,2,40,3],[0,0,0,2],[32,1,32,4],[33,1,33,4],[26,1,26,4],[11,1,11,4],[5,1,5,4],[6,1,6,4],[23,2,23,3],[7,1,7,4],[31,2,31,3],[29,1,29,4],[24,1,24,4],[30,2,30,3]]}
["Click here to get a list of worksheets and go quickly to another worksheet"]
[]
[null,"General Privacy Desktop Audit"]
[]
[null,"Notes on completing this worksheet"]
[null,"The Information Privacy Act 2009 places obligations on agencies to handle, collect, store, secure, use and disclose personal information in accordance with the privacy principles.  It also creates obligations in relation to allowing individuals to access and amendment their own personal information."]
{"$rows_left_out":38}
{"sheet":"IPP5. Personal Info Holdings","index":13,"n_rows":27,"n_cols":9,"rows_kept":27,"cut":false,"hidden":false,"merged":[[0,0,0,2],[26,1,26,4],[10,1,10,4],[18,1,18,4],[5,1,5,4],[6,1,6,4],[7,1,7,4],[19,2,19,3],[20,2,20,3],[25,2,25,3],[22,1,22,4],[16,1,16,4],[11,1,11,3],[24,2,24,3],[24,4,25,4]]}
["Click here to get a list of worksheets and go quickly to another worksheet"]
[]
[null,"Assessment of IPP5 - Providing information about documents containing personal information"]
[]
[null,"Notes on completing this worksheet"]
[null,"Information Privacy Principle (IPP) 5 concerns the transparency of agency actions when dealing with personal information and ensuring that individuals whom the information is about are able to exercise some measure\nof control over it. IPP5 require agencies to:\n• make people aware of what kinds of personal information they hold and why\n• tell people how they can get access to it"]
{"$rows_left_out":22}
{"sheet":"NPP5. Personal Info Holdings","index":14,"n_rows":29,"n_cols":9,"rows_kept":29,"cut":false,"hidden":false,"merged":[[0,0,0,2],[28,1,28,4],[10,1,10,4],[20,1,20,4],[5,1,5,4],[6,1,6,4],[7,1,7,4],[27,2,27,3],[24,1,24,4],[21,2,21,3],[22,2,22,3],[18,1,18,4],[11,1,11,3],[26,2,26,3],[26,4,27,4]]}
["Click here to get a list of worksheets and go quickly to another worksheet"]
[]
[null,"Assessment of NPP5 - Openness"]
[]
[null,"Notes on completing this worksheet"]
[null,"National Privacy Principle (NPP) 5 concerns the transparency of agency actions when dealing with personal information and ensuring that individuals whom the information is about are able to exercise some measure of control over it. NPP5 requires agencies to:\n• make people aware of what kinds of personal information they hold and why\nIt is best practice to also tell people how they can get access to it"]
{"$rows_left_out":24}
{"sheet":"IPP2. Forms Assessment","index":15,"n_rows":130,"n_cols":36,"rows_kept":130,"cut":false,"hidden":false,"merged":[[122,2,123,2],[122,3,123,3],[122,4,123,4],[122,6,123,6],[7,1,7,7],[8,1,8,7],[10,3,10,4],[11,3,11,4],[10,5,10,6],[11,5,11,6],[0,0,0,2],[0,7,0,11],[4,1,4,7],[5,1,5,7],[6,1,6,7],[122,14,122,15],[122,21,122,25],[13,4,14,6],[13,2,13,3],[14,2,14,3],[19,21,19,25],[19,14,19,15],[15,3,15,6],[122,7,123,7],[122,5,123,5],[17,1,17,11],[122,9,123,9],[122,10,122,12],[19,1,20,1],[19,2,20,2],[122,1,123,1],[122,13,123,13],[19,3,20,3],[19,10,19,12],[19,13,20,13],[19,4,20,4],[19,6,20,6],[19,7,20,7],[19,9,20,9],[19,5,20,5]]}
["Click here to get a list of worksheets and go quickly to another worksheet"]
[]
[null,"Forms - Detailed assessment for compliance with Privacy Principles (focus on IPP2 compliance)"]
[]
[null,"Notes on completing this worksheet"]
[null,"Whenever an agency invites the provision of information, by completion of a form, Information Privacy Principle (IPP) 2, requires that the agency takes all reasonable steps to advise the individual of -\n• the purpose of the collection, \n• any law that might authorise or require the collection, and \n• anyone who would usually receive the information in turn, either first or second hand.\nThis information is termed a ‘collection notice’.  Although not required under IPP 2, good practice would be to advise the individual if the information was routinely kept confidential and secure."]
{"$rows_left_out":125}
{"sheet":"NPP1. Forms Assessment","index":16,"n_rows":132,"n_cols":39,"rows_kept":132,"cut":false,"hidden":false,"merged":[[124,13,125,13],[124,1,125,1],[124,2,125,2],[124,3,125,3],[124,4,125,4],[124,10,125,10],[21,1,22,1],[21,2,22,2],[21,3,22,3],[21,5,22,5],[13,3,13,4],[17,3,17,7],[15,4,16,7],[15,2,15,3],[16,2,16,3],[21,7,22,7],[21,24,21,27],[21,13,21,15],[21,16,22,16],[21,17,21,18],[12,3,12,4],[21,8,22,8],[12,5,12,6],[0,0,0,2],[0,8,0,12],[21,19,22,19],[4,1,4,7],[5,1,5,7],[6,1,6,7],[13,5,13,6],[7,1,7,7],[8,1,8,7],[19,1,19,12],[21,4,22,4],[21,9,22,9],[21,10,22,10],[21,12,22,12],[21,6,22,6],[10,1,10,10]]}
["Click here to get a list of worksheets and go quickly to another worksheet"]
[]
[null,"Forms - Detailed assessment for compliance with Privacy Principles (focus on NPP1 compliance)"]
[]
[null,"Notes on completing this worksheet"]
[null,"Whenever health agencies invite the provision of personal information, by completion of a form, National Privacy Principle (NPP) 1, requires that the agency takes all reasonable steps to advise the individual of -\n• the identity of the department and how to contact it\n• the fact he or she is able to gain access to the information\n• the purpose of the collection, \n• any law that might authorise or require the collection,\n• anyone who would usually receive the information in turn, either first or second hand, and\n• the main consequences, if any, for the individual if all or part of the information is not provided.\nThis information is termed a ‘collection notice’.  Although not required under NPP1, good practice would be to advise the individual if the information was routinely kept confidential and secure."]
{"$rows_left_out":127}
{"sheet":"IPP2-NPP1. Email Assessment","index":17,"n_rows":121,"n_cols":14,"rows_kept":121,"cut":false,"hidden":false,"merged":[[10,2,10,4],[18,1,18,8],[0,0,0,3],[0,6,0,8],[4,1,4,7],[5,1,5,7],[6,1,6,7],[7,1,7,7],[8,1,8,7],[16,3,16,7],[14,4,15,7],[14,2,14,3],[15,2,15,3],[10,5,10,6]]}
["Click here to get a list of worksheets and go quickly to another worksheet"]
[]
[null,"Email Contact Addresses - Detailed assessment for compliance with Privacy Principles"]
[]
[null,"Notes on completing this worksheet"]
[null,"Whenever an agency obtains personal information electronically, through an email to an agency contact email facility, Information Privacy Principle (IPP) 2 and National Privacy Principle (NPP) 1, requires that the agency takes all reasonable steps to provide a collection notice as that for a form."]
{"$rows_left_out":116}
{"sheet":"10. Other agency websites","index":18,"n_rows":54,"n_cols":21,"rows_kept":54,"cut":false,"hidden":false,"merged":[[10,2,10,3],[9,4,10,8],[0,0,0,8],[13,1,13,11],[14,1,14,11],[4,1,4,10],[5,1,5,10],[6,1,6,10],[7,1,7,10],[11,3,11,8],[9,2,9,3]]}
["Click here to get a list of worksheets and go quickly to another worksheet"]
[]
[null,"Agency Websites Review - Scan of additional websites managed by the agency"]
[]
[null,"Notes on completing this worksheet"]
[null,"This worksheet is completely optional.  Some agencies maintain multiple websites geared towards different audiences, or for different service areas.  It is important that users of government services are able to access correct and up to date information on right to information and privacy through all websites of the agency.  This refers only to websites of the agency under review, and not websites for related agencies, for example, NOT websites for related statutory authorities or agencies for which the agency under review is a parent agency."]
{"$rows_left_out":49}
{"sheet":"11. Website issues","index":19,"n_rows":19,"n_cols":33,"rows_kept":19,"cut":false,"hidden":false,"merged":[[12,1,12,5],[0,0,0,3],[5,1,5,5],[6,1,6,5],[10,1,10,5],[9,1,9,5],[8,1,8,5]]}
["Click here to get a list of worksheets and go quickly to another worksheet",null,null,null,null,null,null,null,null,null,null,null,null,null,null,null,null,null,null,null,null,null,null,null,null,null,null,null,null,null,null,null,"Menu"]
[]
[null,"Website Content - Issues"]
[]
[null,"Notes on completing this worksheet"]
[null,"This worksheet provides an opportunity to list issues with missing information, broken and missing links and out of date or inaccurate information in the agency website in an easily reportable format."]
{"$rows_left_out":14}
{"sheet":"Electronic Audit","index":20,"n_rows":90,"n_cols":12,"rows_kept":90,"cut":false,"hidden":false,"merged":[[77,3,77,4],[89,1,89,2],[89,3,89,4],[86,1,86,2],[86,3,86,4],[87,1,87,2],[87,3,87,4],[0,0,0,5],[88,1,88,2],[88,3,88,4],[85,1,85,2],[85,3,85,4],[77,1,77,2],[78,1,78,2],[79,1,79,2],[80,1,80,2],[78,3,78,4],[79,3,79,4],[80,3,80,4],[84,1,84,2],[84,3,84,4],[10,1,10,10],[73,1,73,2],[73,3,73,10],[4,1,4,10],[5,1,5,10],[6,1,6,10],[8,1,8,10],[16,3,16,9],[12,3,12,9],[13,3,13,9],[14,3,14,9],[15,3,15,9]]}
["Click here to get a list of worksheets and go quickly to another worksheet"]
[]
[null,"Agency Responses to Electronic Audit"]
[]
[null,"Notes on completing this worksheet"]
[null,"All auditable agencies are required to complete the Right to Information and Information Privacy Agency Electronic Audit supplied by the Office of the Information Commissioner and to provide a completed copy to the office.  Agencies should have a copy of their most recent assessment of compliance.\nThe electronic audit works by self assessment, a method that is appropriate to monitor low risk issues across all agencies. In addition to performance monitoring, the electronic audit instrument is intended to be of assistance to agencies, because it provides in one document a list of all the legislative obligations. Agencies can also use the electronic audit as a reference tool or as a training resource within the agency."]
{"$rows_left_out":85}
{"sheet":"References","index":21,"n_rows":45,"n_cols":3,"rows_kept":45,"cut":false,"hidden":false,"merged":[[44,2,44,9],[17,2,17,9],[37,2,37,9],[22,2,22,9],[28,2,28,9],[29,2,29,9],[25,2,25,9],[30,2,30,9],[20,2,20,9],[43,2,43,9],[36,2,36,9],[41,2,41,9],[42,2,42,9],[38,2,38,9],[21,2,21,9],[33,2,33,9],[0,0,0,4],[4,1,4,9],[5,1,5,9],[6,1,6,9],[9,2,9,9],[10,2,10,9],[11,2,11,9],[12,2,12,9],[15,2,15,9],[16,2,16,9]]}
["Click here to get a list of worksheets and go quickly to another worksheet"]
[]
[null,"References and source documents for Desktop Audit"]
[]
[null,"Notes on using this worksheet"]
[null,"This worksheet provides a complete list of the publicly available reference and source documents referenced and used during the desktop audit."]
{"$rows_left_out":40}
{"sheet":"Menu","index":22,"n_rows":43,"n_cols":3,"rows_kept":43,"cut":false,"hidden":false,"merged":[]}
[]
[]
[]
[]
[]
[]
{"$rows_left_out":38}
{"sheet":"Document Control","index":23,"n_rows":13,"n_cols":5,"rows_kept":13,"cut":false,"hidden":false,"merged":[[0,0,0,3]]}
["Click here to get a list of worksheets and go quickly to another worksheet"]
[]
[null,"Document Control Table"]
[]
[null,"Version","Changes","Author","Release Date"]
[null,"2.0","Initial Release","OIC","2011-11-18"]
{"$rows_left_out":7}